Reaction Details
TargetDual specificity protein kinase TTK
LigandBDBM236666
Substrate/Competitorn/a
Meas. Tech.Kinase Assay
pH7.7±n/a
Temperature295.15±n/a K
IC50 1.9±n/a nM
Commentsextracted
Citation Klar, UKoppitz, MNguyen, DKosemund, DNeuhaus, RSiemeister, G Substituted benzimidazoles US Patent US9388140 Publication Date 7/12/2016
 
Dual specificity protein kinase TTK
Name:Dual specificity protein kinase TTK
Type:Protein
Mol. Mass.:97086.79
Organism:Homo sapiens (Human)
Description:P33981
Residue:857
BDBM236666
NameBDBM236666
Synonyms:US9388140, 7
TypeSmall organic molecule
Emp. Form.C27H27FN4O
Mol. Mass.442.5279
SMILESCC(C)CNc1cc(cc2n(cnc12)-c1ccc(cc1)C(=O)NC1CC1)-c1ccc(F)cc1