Reaction Details
TargetDual specificity protein kinase TTK
LigandBDBM236678
Substrate/Competitorn/a
Meas. Tech.Kinase Assay
pH7.7±n/a
Temperature295.15±n/a K
IC50 1.2±n/a nM
Commentsextracted
Citation Klar, UKoppitz, MNguyen, DKosemund, DNeuhaus, RSiemeister, G Substituted benzimidazoles US Patent US9388140 Publication Date 7/12/2016
 
Dual specificity protein kinase TTK
Name:Dual specificity protein kinase TTK
Type:Protein
Mol. Mass.:97086.79
Organism:Homo sapiens (Human)
Description:P33981
Residue:857
BDBM236678
NameBDBM236678
Synonyms:US9388140, 19
TypeSmall organic molecule
Emp. Form.C31H34FN5O2
Mol. Mass.527.6324
SMILESCc1ccc(F)cc1Nc1cc(NCC2CCOCC2)c2ncn(-c3ccc(C(=O)NC4CC4)c(C)c3)c2c1