Reaction Details
TargetDual specificity protein kinase TTK
LigandBDBM236679
Substrate/Competitorn/a
Meas. Tech.Kinase Assay
pH7.7±n/a
Temperature295.15±n/a K
IC50 1.5±n/a nM
Commentsextracted
Citation Klar, UKoppitz, MNguyen, DKosemund, DNeuhaus, RSiemeister, G Substituted benzimidazoles US Patent US9388140 Publication Date 7/12/2016
 
Dual specificity protein kinase TTK
Name:Dual specificity protein kinase TTK
Type:Protein
Mol. Mass.:97086.79
Organism:Homo sapiens (Human)
Description:P33981
Residue:857
BDBM236679
NameBDBM236679
Synonyms:US9388140, 20
TypeSmall organic molecule
Emp. Form.C31H34N4O3
Mol. Mass.510.6267
SMILESCc1cc(ccc1C(=O)NC1CC1)-n1cnc2c(NCC3CCOCC3)cc(cc12)-c1ccccc1CO