Reaction Details
TargetDual specificity protein kinase TTK
LigandBDBM236697
Substrate/Competitorn/a
Meas. Tech.Kinase Assay
pH7.7±n/a
Temperature295.15±n/a K
IC50 0.4±n/a nM
Commentsextracted
Citation Klar, UKoppitz, MNguyen, DKosemund, DNeuhaus, RSiemeister, G Substituted benzimidazoles US Patent US9388140 Publication Date 7/12/2016
 
Dual specificity protein kinase TTK
Name:Dual specificity protein kinase TTK
Type:Protein
Mol. Mass.:97086.79
Organism:Homo sapiens (Human)
Description:P33981
Residue:857
BDBM236697
NameBDBM236697
Synonyms:US9388140, 38
TypeSmall organic molecule
Emp. Form.C27H24F4N4O3
Mol. Mass.528.4981
SMILESCOc1ccc(Oc2cc(NCCC(F)(F)F)c3ncn(-c4ccc(cc4)C(=O)NC4CC4)c3c2)cc1F