Reaction Details
TargetDual specificity protein kinase TTK
LigandBDBM236683
Substrate/Competitorn/a
Meas. Tech.Kinase Assay
pH7.7±n/a
Temperature295.15±n/a K
IC50 0.7±n/a nM
Commentsextracted
Citation Klar, UKoppitz, MNguyen, DKosemund, DNeuhaus, RSiemeister, G Substituted benzimidazoles US Patent US9388140 Publication Date 7/12/2016
 
Dual specificity protein kinase TTK
Name:Dual specificity protein kinase TTK
Type:Protein
Mol. Mass.:97086.79
Organism:Homo sapiens (Human)
Description:P33981
Residue:857
BDBM236683
NameBDBM236683
Synonyms:BDBM236703 | US9388140, 24
TypeSmall organic molecule
Emp. Form.C31H33FN4O4
Mol. Mass.544.6165
SMILESCOc1ccc(Oc2cc(NCC3CCOCC3)c3ncn(-c4ccc(C(=O)NC5CC5)c(C)c4)c3c2)cc1F