Reaction Details
TargetDual specificity protein kinase TTK
LigandBDBM236711
Substrate/Competitorn/a
Meas. Tech.Kinase Assay
pH7.7±n/a
Temperature295.15±n/a K
IC50 0.9±n/a nM
Commentsextracted
Citation Klar, UKoppitz, MNguyen, DKosemund, DNeuhaus, RSiemeister, G Substituted benzimidazoles US Patent US9388140 Publication Date 7/12/2016
 
Dual specificity protein kinase TTK
Name:Dual specificity protein kinase TTK
Type:Protein
Mol. Mass.:97086.79
Organism:Homo sapiens (Human)
Description:P33981
Residue:857
BDBM236711
NameBDBM236711
Synonyms:US9388140, 52
TypeSmall organic molecule
Emp. Form.C30H30F3N5O2
Mol. Mass.549.5867
SMILESCNC(=O)c1ccc(cc1C)-c1cc(NCCC(F)(F)F)c2ncn(-c3ccc(C(=O)NC4CC4)c(C)c3)c2c1