Reaction Details
TargetDual specificity protein kinase TTK
LigandBDBM236724
Substrate/Competitorn/a
Meas. Tech.Kinase Assay
pH7.7±n/a
Temperature295.15±n/a K
IC50 2.1±n/a nM
Commentsextracted
Citation Klar, UKoppitz, MNguyen, DKosemund, DNeuhaus, RSiemeister, G Substituted benzimidazoles US Patent US9388140 Publication Date 7/12/2016
 
Dual specificity protein kinase TTK
Name:Dual specificity protein kinase TTK
Type:Protein
Mol. Mass.:97086.79
Organism:Homo sapiens (Human)
Description:P33981
Residue:857
BDBM236724
NameBDBM236724
Synonyms:US9388140, 66
TypeSmall organic molecule
Emp. Form.C26H23F5N4O2
Mol. Mass.518.4784
SMILESCCNC(=O)c1ccc(cc1C)-n1cnc2c(NCCC(F)(F)F)cc(Oc3cccc(F)c3F)cc12