Reaction Details
TargetDual specificity protein kinase TTK
LigandBDBM236739
Substrate/Competitorn/a
Meas. Tech.Kinase Assay
pH7.7±n/a
Temperature295.15±n/a K
IC50 0.7±n/a nM
Commentsextracted
Citation Klar, UKoppitz, MNguyen, DKosemund, DNeuhaus, RSiemeister, G Substituted benzimidazoles US Patent US9388140 Publication Date 7/12/2016
 
Dual specificity protein kinase TTK
Name:Dual specificity protein kinase TTK
Type:Protein
Mol. Mass.:97086.79
Organism:Homo sapiens (Human)
Description:P33981
Residue:857
BDBM236739
NameBDBM236739
Synonyms:US9388140, 83
TypeSmall organic molecule
Emp. Form.C27H24F4N4O3
Mol. Mass.528.4981
SMILESCc1cc(ccc1C(=O)NC1CC1)-n1cnc2c(NCCC(F)(F)F)cc(Oc3ccc(O)c(F)c3)cc12