Reaction Details
TargetRibosomal protein S6 kinase alpha-1
LigandBDBM236884
Substrate/Competitorn/a
Meas. Tech.Phosphorylation Assay
Temperature310.15±n/a K
IC50 8.5±n/a nM
Commentsextracted
Citation Blake, JChen, HChicarelli, MGaudino, JGazzard, LKintz, SMohr, PRobarge, KSchwarz, JZhou, A Serine/threonine kinase inhibitors US Patent US9388171 Publication Date 7/12/2016
 
Ribosomal protein S6 kinase alpha-1
Name:Ribosomal protein S6 kinase alpha-1
Type:Serine/threonine-protein kinase
Mol. Mass.:82736.10
Organism:Homo sapiens (Human)
Description:n/a
Residue:735
BDBM236884
NameBDBM236884
Synonyms:US9388171, II-2
TypeSmall organic molecule
Emp. Form.C24H25ClFN3O2
Mol. Mass.441.926
SMILESCC[C@@H](NC(=O)c1ccc2cnc(NC3CCOCC3)cc2c1)c1ccc(Cl)c(F)c1