Reaction Details
TargetRibosomal protein S6 kinase alpha-1
LigandBDBM236887
Substrate/Competitorn/a
Meas. Tech.Phosphorylation Assay
Temperature310.15±n/a K
IC50 65.1±n/a nM
Commentsextracted
Citation Blake, JChen, HChicarelli, MGaudino, JGazzard, LKintz, SMohr, PRobarge, KSchwarz, JZhou, A Serine/threonine kinase inhibitors US Patent US9388171 Publication Date 7/12/2016
 
Ribosomal protein S6 kinase alpha-1
Name:Ribosomal protein S6 kinase alpha-1
Type:Serine/threonine-protein kinase
Mol. Mass.:82736.10
Organism:Homo sapiens (Human)
Description:n/a
Residue:735
BDBM236887
NameBDBM236887
Synonyms:US9388171, II-23
TypeSmall organic molecule
Emp. Form.C22H21FN4O2
Mol. Mass.392.4261
SMILESC[C@@H](CO)Nc1cc2cc(ccc2cn1)C(=O)NCc1cc2c(F)cccc2[nH]1