Reaction Details
TargetRibosomal protein S6 kinase alpha-1
LigandBDBM236890
Substrate/Competitorn/a
Meas. Tech.Phosphorylation Assay
Temperature310.15±n/a K
IC50 5.47±n/a nM
Commentsextracted
Citation Blake, JChen, HChicarelli, MGaudino, JGazzard, LKintz, SMohr, PRobarge, KSchwarz, JZhou, A Serine/threonine kinase inhibitors US Patent US9388171 Publication Date 7/12/2016
 
Ribosomal protein S6 kinase alpha-1
Name:Ribosomal protein S6 kinase alpha-1
Type:Serine/threonine-protein kinase
Mol. Mass.:82736.10
Organism:Homo sapiens (Human)
Description:n/a
Residue:735
BDBM236890
NameBDBM236890
Synonyms:US9388171, II-64
TypeSmall organic molecule
Emp. Form.C27H30N6O2
Mol. Mass.470.5661
SMILESCOc1ccc(cc1)[C@@H]1CN(C)C[C@H]1NC(=O)c1ccc2cnc(Nc3cc(C)nn3C)cc2c1