Reaction Details
TargetVascular endothelial growth factor receptor 2
LigandBDBM139604
Substrate/Competitorn/a
Meas. Tech.VEGFR2 Kinase Assay
pH7.4±n/a
Temperature303.15±n/a K
IC50 17±n/a nM
Commentsextracted
Citation Hull, III, CEMalone, TC Method of treating conditiions with kinase inhibitors US Patent US9388176 Publication Date 7/12/2016
 
Vascular endothelial growth factor receptor 2
Name:Vascular endothelial growth factor receptor 2
Type:Receptor Tyrosine Kinase
Mol. Mass.:151510.97
Organism:Homo sapiens (Human)
Description:P35968
Residue:1356
BDBM139604
NameBDBM139604
Synonyms:US8889870, 150 US9820989, 150
TypeSmall organic molecule
Emp. Form.C24H27N5O
Mol. Mass.401.5041
SMILESCC(C)c1cccc(NC(=O)c2cc(C)cc(c2)N2CCc3nc(N)ncc3C2)c1