Reaction Details
TargetPlatelet-derived growth factor receptor beta
LigandBDBM139546
Substrate/Competitorn/a
Meas. Tech.PDGFRβ Kinase Assay
pH7.4±n/a
Temperature303.15±n/a K
IC50 90±n/a nM
Commentsextracted
Citation Hull, III, CEMalone, TC Method of treating conditiions with kinase inhibitors US Patent US9388176 Publication Date 7/12/2016
 
Platelet-derived growth factor receptor beta
Name:Platelet-derived growth factor receptor beta
Type:Enzyme
Mol. Mass.:123922.25
Organism:Homo sapiens (Human)
Description:P09619
Residue:1106
BDBM139546
NameBDBM139546
Synonyms:US8889870, 6 US9820989, 6
TypeSmall organic molecule
Emp. Form.C21H21N5O
Mol. Mass.359.4243
SMILESCc1ccc(NC(=O)c2cccc(c2)N2CCc3nc(N)ncc3C2)cc1