Reaction Details
TargetPlatelet-derived growth factor receptor beta
LigandBDBM139604
Substrate/Competitorn/a
Meas. Tech.PDGFRβ Kinase Assay
pH7.4±n/a
Temperature303.15±n/a K
IC50 59±n/a nM
Commentsextracted
Citation Hull, III, CEMalone, TC Method of treating conditiions with kinase inhibitors US Patent US9388176 Publication Date 7/12/2016
 
Platelet-derived growth factor receptor beta
Name:Platelet-derived growth factor receptor beta
Type:Enzyme
Mol. Mass.:123922.25
Organism:Homo sapiens (Human)
Description:P09619
Residue:1106
BDBM139604
NameBDBM139604
Synonyms:US8889870, 150 US9820989, 150
TypeSmall organic molecule
Emp. Form.C24H27N5O
Mol. Mass.401.5041
SMILESCC(C)c1cccc(NC(=O)c2cc(C)cc(c2)N2CCc3nc(N)ncc3C2)c1