Reaction Details
TargetPlatelet-derived growth factor receptor beta
LigandBDBM139618
Substrate/Competitorn/a
Meas. Tech.PDGFRβ Kinase Assay
pH7.4±n/a
Temperature303.15±n/a K
IC50 36±n/a nM
Commentsextracted
Citation Hull, III, CEMalone, TC Method of treating conditiions with kinase inhibitors US Patent US9388176 Publication Date 7/12/2016
 
Platelet-derived growth factor receptor beta
Name:Platelet-derived growth factor receptor beta
Type:Enzyme
Mol. Mass.:123922.25
Organism:Homo sapiens (Human)
Description:P09619
Residue:1106
BDBM139618
NameBDBM139618
Synonyms:US8889870, 166 US9820989, 166
TypeSmall organic molecule
Emp. Form.C23H24N4O
Mol. Mass.372.4629
SMILESCc1cccc(NC(=O)Nc2ccc(N3CCc4ccncc4C3)c(C)c2)c1