Reaction Details
TargetPotassium voltage-gated channel subfamily H member 2
LigandBDBM50121975
Substrate/Competitorn/a
Meas. Tech.Inhibition Assay
pH7±n/a
IC50 1.44e+3±n/a nM
Commentsextracted
Citation Peoples, AJHughes, DLing, LLMillett, WNitti, ASpoering, ASteadman, VAChiva, JCLazarides, LJones, MKPoullennec, KGLewis, KEpstein, S Depsipeptide and uses thereof US Patent US9402878 Publication Date 8/2/2016
 
Potassium voltage-gated channel subfamily H member 2
Name:Potassium voltage-gated channel subfamily H member 2
Type:Multi-pass membrane protein
Mol. Mass.:126672.65
Organism:Homo sapiens (Human)
Description:Q12809
Residue:1159
BDBM50121975
NameBDBM50121975
Synonyms:(6-Methoxy-quinolin-4-yl)-(5-vinyl-1-aza-bicyclo[2.2.2]oct-2-yl)-methanol CHEMBL1294 DURAQUIN QUINAGLUTE QUINATIME QUINIDINE US9402878, Quinidine
TypeSmall organic molecule
Emp. Form.C20H24N2O2
Mol. Mass.324.4168
SMILESCOc1ccc2nccc([C@H](O)[C@H]3C[C@@H]4CCN3C[C@@H]4C=C)c2c1