Reaction Details
TargetApoptosis regulator Bcl-2
LigandBDBM237168
Substrate/Competitorn/a
Meas. Tech.Time Resolved-Fluorescence Resonance Energy Transfer (TR-FRET) Assay
Temperature298.15±n/a K
Ki<0.010±n/a nM
Commentsextracted
Citation Tao, ZWang, XSouers, AJCatron, NDSullivan, GM Apoptosis-inducing agents for the treatment of cancer and immune and autoimmune diseases US Patent US9403822 Publication Date 8/2/2016
 
Apoptosis regulator Bcl-2
Name:Apoptosis regulator Bcl-2
Type:Homodimer or heterodimer
Mol. Mass.:26269.11
Organism:Homo sapiens (Human)
Description:P10415
Residue:239
BDBM237168
NameBDBM237168
Synonyms:US9403822, 1
TypeSmall organic molecule
Emp. Form.C48H57ClN7O11PS
Mol. Mass.1006.498
SMILESCO[C@H]1CC[C@H](CNc2ccc(cc2[N+]([O-])=O)S(=O)(=O)NC(=O)c2ccc(cc2Oc2cn(COP(O)(O)=O)c3nccc3c2)N2CCN(CC3=C(CC(C)(C)CC3)c3ccc(Cl)cc3)CC2)CC1