Reaction Details
TargetDual specificity mitogen-activated protein kinase kinase 1/2
LigandBDBM237223
Substrate/Competitorn/a
Meas. Tech.Cell-Based Enzyme Inhibition Assay (ELISA)
IC50>2.5e+4±n/a nM
Citation Li, QSLv, PCLi, HQLu, XLi, ZLRuan, BFZhu, HL Synthesis and biological evaluation of novel N, N'-disubstituted urea and thiourea derivatives as potential anti-melanoma agents. J Enzyme Inhib Med Chem27:708-14 (2012) 
 
Dual specificity mitogen-activated protein kinase kinase 1/2
Name:Dual specificity mitogen-activated protein kinase kinase 1/2
Type:n/a
Mol. Mass.:n/a
Description:ASSAY_ID of ChEMBL is 795758
Components:This complex has 2 components.
Component 1
Name:Dual specificity mitogen-activated protein kinase kinase 2
Synonyms:Dual specificity mitogen-activated protein kinase kinase 2 (MEK2) ERK activator kinase 2 MAP2K2 MAPKK 2 MKK2 PRKMK2 | VHL-MAP2K1/MAP2K2
Type:Enzyme Catalytic Domain
Mol. Mass.:44423.61
Organism:Homo sapiens (Human)
Description:gi_13489054
Residue:400
Component 2
Name:Dual specificity mitogen-activated protein kinase kinase 1
Synonyms:Dual specificity mitogen-activated protein kinase (MEK) Dual specificity mitogen-activated protein kinase kinase 1 (MEK1) Dual specificity mitogen-activated protein kinase kinase MEK1/2 MAP kinase kinase 1 MAPK/ERK kinase 1 MEK-1 MP2K1_HUMAN PRKMK1 | VHL-MAP2K1/MAP2K2
Type:Other Protein Type
Mol. Mass.:43439.03
Organism:Homo sapiens (Human)
Description:Full-length human MEK-1 was generated by PCR and purified as a fusion protein from Escherichia coli lysates.
Residue:393
BDBM237223
NameBDBM237223
Synonyms:1-(4-Fluorophenyl)-1-(4-hydroxy-3-methoxybenzyl)-3-phenylthiourea (4b)
TypeSmall organic molecule
Emp. Form.C21H19FN2O2S
Mol. Mass.382.451
SMILESCOc1cc(CN(C(=S)Nc2ccccc2)c2ccc(F)cc2)ccc1O