Reaction Details
TargetCarbonic anhydrase 2
LigandBDBM237231
Substrate/CompetitorBDBM237235
Meas. Tech.CA Activity Assay
pH7.4±0
Temperature298.15±0 K
Ki 228±n/a nM
Citation Ekinci, DAl-Rashida, MAbbas, GSentürk, MSupuran, CT Chromone containing sulfonamides as potent carbonic anhydrase inhibitors. J Enzyme Inhib Med Chem27:744-7 (2012) 
 
Carbonic anhydrase 2
Name:Carbonic anhydrase 2
Type:Enzyme
Mol. Mass.:29250.71
Organism:Homo sapiens (Human)
Description:P00918
Residue:260
BDBM237231
BDBM237235
NameBDBM237231
Synonyms:hCA inhibitor, 1
TypeSmall organic molecule
Emp. Form.C18H18N2O5S
Mol. Mass.374.411
SMILESCCOC1Oc2ccccc2C(=O)\C1=C/Nc1ccc(cc1)S(N)(=O)=O