Reaction Details
TargetCarbonic anhydrase 1
LigandBDBM237281
Substrate/Competitorn/a
Meas. Tech.CA Activity Assay
pH7.4±n/a
Ki 50110±n/a nM
Commentsextracted
Citation Ekinci, DKurbanoglu, NISalamci, ESentürk, MSupuran, CT Carbonic anhydrase inhibitors: inhibition of human and bovine isoenzymes by benzenesulphonamides, cyclitols and phenolic compounds. J Enzyme Inhib Med Chem27:845-8 (2012) 
 
Carbonic anhydrase 1
Name:Carbonic anhydrase 1
Type:Enzyme
Mol. Mass.:28873.37
Organism:Homo sapiens (Human)
Description:P00915
Residue:261
BDBM237281
NameBDBM237281
Synonyms:Carbonic anhydrase inhibitors (CAIs), 1
TypeSmall organic molecule
Emp. Form.C14H15NO2S
Mol. Mass.261.339
SMILESCc1ccc(NS(=O)(=O)c2ccc(C)cc2)cc1