Reaction Details
TargetCarbonic anhydrase 1
LigandBDBM60968
Substrate/Competitorn/a
Meas. Tech.CA Activity Assay
pH7.4±n/a
Ki 9336±n/a nM
Commentsextracted
Citation Ekinci, DKurbanoglu, NISalamci, ESentürk, MSupuran, CT Carbonic anhydrase inhibitors: inhibition of human and bovine isoenzymes by benzenesulphonamides, cyclitols and phenolic compounds. J Enzyme Inhib Med Chem27:845-8 (2012) 
 
Carbonic anhydrase 1
Name:Carbonic anhydrase 1
Type:Enzyme
Mol. Mass.:28873.37
Organism:Homo sapiens (Human)
Description:P00915
Residue:261
BDBM60968
NameBDBM60968
Synonyms:Carbonic anhydrase inhibitors (CAIs), 6
Typen/a
Emp. Form.C13H19NO5S
Mol. Mass.301.359
SMILESCc1ccc(cc1)S(=O)(=O)N[C@H]1[C@@H](O)CC[C@@H](O)[C@@H]1O