Reaction Details
TargetCarbonic anhydrase 1
LigandBDBM36071
Substrate/Competitorn/a
Meas. Tech.CA Activity Assay
pH7.4±n/a
Ki 134600±n/a nM
Commentsextracted
Citation Ekinci, DKurbanoglu, NISalamci, ESentürk, MSupuran, CT Carbonic anhydrase inhibitors: inhibition of human and bovine isoenzymes by benzenesulphonamides, cyclitols and phenolic compounds. J Enzyme Inhib Med Chem27:845-8 (2012) 
 
Carbonic anhydrase 1
Name:Carbonic anhydrase 1
Type:Enzyme
Mol. Mass.:28873.37
Organism:Homo sapiens (Human)
Description:P00915
Residue:261
BDBM36071
NameBDBM36071
Synonyms:(1R,2R)-trans-1,2-cyclohexanediol | trans-(1R(S),2R(S))-cyclohexane-1,2-diol (10)
TypeGuest
Emp. Form.C6H12O2
Mol. Mass.116.1583
SMILESO[C@@H]1CCCC[C@H]1O