Reaction Details
TargetCarbonic anhydrase 1
LigandBDBM60969
Substrate/Competitorn/a
Meas. Tech.CA Inhibition Assay
pH7.5±n/a
Temperature298.15±n/a K
Ki 2.27e+3±n/a nM
Commentsextracted
Citation Özdemir, ZÿSentürk, MEkinci, D Inhibition of mammalian carbonic anhydrase isoforms I, II and VI with thiamine and thiamine-like molecules. J Enzyme Inhib Med Chem28:316-9 (2013) 
 
Carbonic anhydrase 1
Name:Carbonic anhydrase 1
Type:Enzyme
Mol. Mass.:28873.37
Organism:Homo sapiens (Human)
Description:P00915
Residue:261
BDBM60969
NameBDBM60969
Synonyms:CA inhibitor, 1
Typen/a
Emp. Form.C7H12NOS
Mol. Mass.158.241
SMILESCc1c(CCO)sc[n+]1C