Reaction Details
TargetCarbonic anhydrase 1
LigandBDBM50149238
Substrate/Competitor4-Nitrophenyl acetate (NPA)
Meas. Tech.Esterase Activity Assay
Ki 1.954e+4±n/a nM
Citation Kazancioglu, EAGüney, MSentürk, MSupuran, CT Simple methanesulfonates are hydrolyzed by the sulfatase carbonic anhydrase activity. J Enzyme Inhib Med Chem27:880-5 (2012) 
 
Carbonic anhydrase 1
Name:Carbonic anhydrase 1
Type:Enzyme
Mol. Mass.:28873.37
Organism:Homo sapiens (Human)
Description:P00915
Residue:261
BDBM50149238
4-Nitrophenyl acetate (NPA)
NameBDBM50149238
Synonyms:4-Hydroxybiphenyl 4-biphenylol 4-hydroxydiphenyl CHEMBL73380 biphenyl-4-ol p-hydroxybiphenyl p-phenylphenol para-phenylphenol
TypeSmall organic molecule
Emp. Form.C12H10O
Mol. Mass.170.2072
SMILESOc1ccc(cc1)-c1ccccc1