Reaction Details
TargetCarbonic anhydrase 1
LigandBDBM50031472
Substrate/Competitor4-Nitrophenyl acetate (NPA)
Meas. Tech.Esterase Activity Assay
Ki 7.35e+3±n/a nM
Citation Kazancioglu, EAGüney, MSentürk, MSupuran, CT Simple methanesulfonates are hydrolyzed by the sulfatase carbonic anhydrase activity. J Enzyme Inhib Med Chem27:880-5 (2012) 
 
Carbonic anhydrase 1
Name:Carbonic anhydrase 1
Type:Enzyme
Mol. Mass.:28873.37
Organism:Homo sapiens (Human)
Description:P00915
Residue:261
BDBM50031472
4-Nitrophenyl acetate (NPA)
NameBDBM50031472
Synonyms:1,2,3-Trihydroxybenzene, XIV Pyrogallol (10) pyrogallol
TypeSmall organic molecule
Emp. Form.C6H6O3
Mol. Mass.126.11
SMILESOc1cccc(O)c1O