Reaction Details
TargetCarbonic anhydrase 4
LigandBDBM237296
Substrate/Competitor4-Nitrophenyl acetate (NPA)
Meas. Tech.Esterase Activity Assay
Ki 4.164e+4±n/a nM
Citation Kazancioglu, EAGüney, MSentürk, MSupuran, CT Simple methanesulfonates are hydrolyzed by the sulfatase carbonic anhydrase activity. J Enzyme Inhib Med Chem27:880-5 (2012) 
 
Carbonic anhydrase 4
Name:Carbonic anhydrase 4
Type:Enzyme
Mol. Mass.:35037.98
Organism:Homo sapiens (Human)
Description:P22748
Residue:312
BDBM237296
4-Nitrophenyl acetate (NPA)
NameBDBM237296
Synonyms:1,2-Phenylenedimethanesulfonate (13)
TypeSmall organic molecule
Emp. Form.C8H10O6S2
Mol. Mass.266.291
SMILESCS(=O)(=O)Oc1ccccc1OS(C)(=O)=O