Reaction Details
TargetCarbonic anhydrase 4
LigandBDBM237297
Substrate/Competitor4-Nitrophenyl acetate (NPA)
Meas. Tech.Esterase Activity Assay
Ki 1.84e+3±n/a nM
Citation Kazancioglu, EAGüney, MSentürk, MSupuran, CT Simple methanesulfonates are hydrolyzed by the sulfatase carbonic anhydrase activity. J Enzyme Inhib Med Chem27:880-5 (2012) 
 
Carbonic anhydrase 4
Name:Carbonic anhydrase 4
Type:Enzyme
Mol. Mass.:35037.98
Organism:Homo sapiens (Human)
Description:P22748
Residue:312
BDBM237297
4-Nitrophenyl acetate (NPA)
NameBDBM237297
Synonyms:Vanillin (14)
TypeSmall organic molecule
Emp. Form.C8H14O3
Mol. Mass.158.195
SMILESCOC1CC(CCC1O)C=O