Reaction Details
TargetCarbonic anhydrase 4
LigandBDBM237299
Substrate/Competitor4-Nitrophenyl acetate (NPA)
Meas. Tech.Esterase Activity Assay
Ki 8.4e+2±n/a nM
Citation Kazancioglu, EAGüney, MSentürk, MSupuran, CT Simple methanesulfonates are hydrolyzed by the sulfatase carbonic anhydrase activity. J Enzyme Inhib Med Chem27:880-5 (2012) 
 
Carbonic anhydrase 4
Name:Carbonic anhydrase 4
Type:Enzyme
Mol. Mass.:35037.98
Organism:Homo sapiens (Human)
Description:P22748
Residue:312
BDBM237299
4-Nitrophenyl acetate (NPA)
NameBDBM237299
Synonyms:Ethoxzolamide (EZA)
TypeSmall organic molecule
Emp. Form.C10H12N2O3S2
Mol. Mass.272.344
SMILESCCOc1ccc2nc(CS(N)(=O)=O)sc2c1