Reaction Details
TargetCarbonic anhydrase 6
LigandBDBM237294
Substrate/Competitor4-Nitrophenyl acetate (NPA)
Meas. Tech.Esterase Activity Assay
Ki 2.843e+4±n/a nM
Citation Kazancioglu, EAGüney, MSentürk, MSupuran, CT Simple methanesulfonates are hydrolyzed by the sulfatase carbonic anhydrase activity. J Enzyme Inhib Med Chem27:880-5 (2012) 
 
Carbonic anhydrase 6
Name:Carbonic anhydrase 6
Type:Enzyme
Mol. Mass.:35371.40
Organism:Homo sapiens (Human)
Description:P23280
Residue:308
BDBM237294
4-Nitrophenyl acetate (NPA)
NameBDBM237294
Synonyms:1,4-Phenylene dimethanesulfonate (6)
TypeSmall organic molecule
Emp. Form.C8H10O6S2
Mol. Mass.266.291
SMILESCS(=O)(=O)Oc1ccc(OS(C)(=O)=O)cc1