Reaction Details
TargetCarbonic anhydrase 6
LigandBDBM237298
Substrate/Competitor4-Nitrophenyl acetate (NPA)
Meas. Tech.Esterase Activity Assay
Ki 1.21e+4±n/a nM
Citation Kazancioglu, EAGüney, MSentürk, MSupuran, CT Simple methanesulfonates are hydrolyzed by the sulfatase carbonic anhydrase activity. J Enzyme Inhib Med Chem27:880-5 (2012) 
 
Carbonic anhydrase 6
Name:Carbonic anhydrase 6
Type:Enzyme
Mol. Mass.:35371.40
Organism:Homo sapiens (Human)
Description:P23280
Residue:308
BDBM237298
4-Nitrophenyl acetate (NPA)
NameBDBM237298
Synonyms:4-Formyl-2-methoxyphenyl methanesulfonate (15)
TypeSmall organic molecule
Emp. Form.C9H10O5S
Mol. Mass.230.238
SMILESCOc1cc(C=O)ccc1OS(C)(=O)=O