Reaction Details
TargetCarbonic anhydrase 3
LigandBDBM10880
Substrate/Competitorn/a
Meas. Tech.Esterase Activity Assay
pH7.4±n/a
Ki 263000±n/a nM
Commentsextracted
Citation Ekinci, DKaragoz, LEkinci, DSenturk, MSupuran, CT Carbonic anhydrase inhibitors: in vitro inhibition of a isoforms (hCA I, hCA II, bCA III, hCA IV) by flavonoids. J Enzyme Inhib Med Chem28:283-8 (2013) 
 
Carbonic anhydrase 3
Name:Carbonic anhydrase 3
Type:Enzyme
Mol. Mass.:29376.92
Organism:Bos taurus (Cattle)
Description:Q3SZX4
Residue:260
BDBM10880
NameBDBM10880
Synonyms:AZA AZM acetazolamide Acetazolamide Acetazolamide (AZA) Acetazolamide, 5 Acetazolamide, AZA CHEMBL20 Sulfonamide, 1 US11278534, Example acetazolamide sulfonamide 1
TypeSmall organic molecule
Emp. Form.C4H6N4O3S2
Mol. Mass.222.245
SMILESCC(=O)Nc1nnc(s1)S(N)(=O)=O