Reaction Details
TargetCarbonic anhydrase 4
LigandBDBM26187
Substrate/Competitorn/a
Meas. Tech.Esterase Activity Assay
pH7.4±n/a
Ki 14300±n/a nM
Commentsextracted
Citation Ekinci, DKaragoz, LEkinci, DSenturk, MSupuran, CT Carbonic anhydrase inhibitors: in vitro inhibition of a isoforms (hCA I, hCA II, bCA III, hCA IV) by flavonoids. J Enzyme Inhib Med Chem28:283-8 (2013) 
 
Carbonic anhydrase 4
Name:Carbonic anhydrase 4
Type:Enzyme
Mol. Mass.:35037.98
Organism:Homo sapiens (Human)
Description:P22748
Residue:312
BDBM26187
NameBDBM26187
Synonyms:α-CA inhibitor, 11 US9688816, 2 | phenol
TypeSmall organic molecule
Emp. Form.C6H6O
Mol. Mass.94.1112
SMILESOc1ccccc1