Reaction Details
TargetCarbonic anhydrase 12
LigandBDBM25900
Substrate/Competitorn/a
Meas. Tech.CA Inhibition Assay
pH7.5±n/a
Temperature298.15±n/a K
Ki 4.5e+3±n/a nM
Commentsextracted
Citation Liu, FMartin-Mingot, ALecornué, FJouannetaud, MPMaresca, AThibaudeau, SSupuran, CT Carbonic anhydrases inhibitory effects of new benzenesulfonamides synthesized by using superacid chemistry. J Enzyme Inhib Med Chem27:886-91 (2012) 
 
Carbonic anhydrase 12
Name:Carbonic anhydrase 12
Type:Enzyme
Mol. Mass.:39456.00
Organism:Homo sapiens (Human)
Description:Catalytic domain of human cloned isozyme was used in the assay
Residue:354
BDBM25900
NameBDBM25900
Synonyms:2-chloro-5-(1-hydroxy-3-oxo-2,3-dihydro-1H-isoindol-1-yl)benzene-1-sulfonamide Chlorthalidone Hygroton US10172837, Chlorthalidone
TypeSmall organic molecule
Emp. Form.C14H11ClN2O4S
Mol. Mass.338.766
SMILESNS(=O)(=O)c1cc(ccc1Cl)C1(O)NC(=O)c2ccccc12