Reaction Details
TargetCarbonic anhydrase 1
LigandBDBM237281
Substrate/Competitorn/a
Meas. Tech.Esterase Activity Assay
IC50 50020±n/a nM
Citation Alp, CÖzsoy, Å¿Alp, NAErdem, DGültekin, MSKüfrevioglu, Ã¿Ä°Sentürk, MSupuran, CT Sulfapyridine-like benzenesulfonamide derivatives as inhibitors of carbonic anhydrase isoenzymes I, II and VI. J Enzyme Inhib Med Chem27:818-24 (2012) 
 
Carbonic anhydrase 1
Name:Carbonic anhydrase 1
Type:Enzyme
Mol. Mass.:28873.37
Organism:Homo sapiens (Human)
Description:P00915
Residue:261
BDBM237281
NameBDBM237281
Synonyms:Carbonic anhydrase inhibitors (CAIs), 1
TypeSmall organic molecule
Emp. Form.C14H15NO2S
Mol. Mass.261.339
SMILESCc1ccc(NS(=O)(=O)c2ccc(C)cc2)cc1