Reaction Details
TargetCarbonic anhydrase 4
LigandBDBM237337
Substrate/Competitorn/a
Meas. Tech.Carbonic Anhydrase I, II, IV and XII Assay
pH7.5±n/a
Temperature298.15±n/a K
IC50 498.8±0.0 nM
Commentsextracted
Citation Supuran, CTMaresca, AGregán, FRemko, M Three new aromatic sulfonamide inhibitors of carbonic anhydrases I, II, IV and XII. J Enzyme Inhib Med Chem28:289-93 (2013) 
 
Carbonic anhydrase 4
Name:Carbonic anhydrase 4
Type:Enzyme
Mol. Mass.:35037.98
Organism:Homo sapiens (Human)
Description:P22748
Residue:312
BDBM237337
NameBDBM237337
Synonyms:N-(3-morpholinopropyl)benzene-1,4-disulfonamide (I-2)
TypeSmall organic molecule
Emp. Form.C13H21N3O5S2
Mol. Mass.363.453
SMILESNS(=O)(=O)c1ccc(cc1)S(=O)(=O)NCCCN1CCOCC1