Reaction Details
TargetCarbonic anhydrase 2
LigandBDBM50428400
Substrate/Competitorn/a
Meas. Tech.CO2 Hydration Assay
pH7.5±n/a
Temperature298.15±n/a K
Ki 395±n/a nM
Commentsextracted
Citation Alp, CMaresca, AAlp, NAGültekin, MSEkinci, DScozzafava, ASupuran, CT Secondary/tertiary benzenesulfonamides with inhibitory action against the cytosolic human carbonic anhydrase isoforms I and II. J Enzyme Inhib Med Chem28:294-8 (2013) 
 
Carbonic anhydrase 2
Name:Carbonic anhydrase 2
Type:Enzyme
Mol. Mass.:29250.71
Organism:Homo sapiens (Human)
Description:P00918
Residue:260
BDBM50428400
NameBDBM50428400
Synonyms:CA inhibitor, 2 [(4-Methylphenyl)Sulfonyl]Phenylamine
TypeSmall organic molecule
Emp. Form.C13H13NO2S
Mol. Mass.247.313
SMILESCc1ccc(cc1)S(=O)(=O)Nc1ccccc1