Reaction Details
TargetCoagulation factor XI
LigandBDBM238252
Substrate/Competitorn/a
Meas. Tech.In Vitro Assay
IC50 3.2±n/a nM
Citation Imagawa, AKondo, TNishiyama, TCourtney, SYarnold, CIchihara, OFlanagan, S Substituted pyrrolidines as factor xia inhibitors for the treatment thromboembolic diseases US Patent US9394250 Publication Date 7/19/2016
 
Coagulation factor XI
Name:Coagulation factor XI
Type:Enzyme
Mol. Mass.:70130.58
Organism:Homo sapiens (Human)
Description:P03951
Residue:625
BDBM238252
NameBDBM238252
Synonyms:US10336741, Example 20 US9394250, 20 | US9585881, Example 20
TypeSmall organic molecule
Emp. Form.C25H30N6O6S
Mol. Mass.542.607
SMILESCS(=O)(=O)N1CCN(CC1)[C@H]1C[C@H](N(C1)C(=O)c1ccc(cc1)C(N)=N)C(=O)Nc1ccc(cc1)C(O)=O