Reaction Details
TargetCoagulation factor XI
LigandBDBM238266
Substrate/Competitorn/a
Meas. Tech.In Vitro Assay
IC50 4.2±n/a nM
Citation Imagawa, AKondo, TNishiyama, TCourtney, SYarnold, CIchihara, OFlanagan, S Substituted pyrrolidines as factor xia inhibitors for the treatment thromboembolic diseases US Patent US9394250 Publication Date 7/19/2016
 
Coagulation factor XI
Name:Coagulation factor XI
Type:Enzyme
Mol. Mass.:70130.58
Organism:Homo sapiens (Human)
Description:P03951
Residue:625
BDBM238266
NameBDBM238266
Synonyms:US10882855, Example 96 US9585881, Example 96
TypeSmall organic molecule
Emp. Form.C29H41ClN6O5S
Mol. Mass.621.191
SMILESCOC(=O)Nc1ccc(cc1)-c1[nH]c(nc1Cl)[C@@H]1C[C@@H](CN1C(=O)[C@H]1CC[C@H](CN)CC1)C1CCN(CC1)S(C)(=O)=O