Reaction Details
TargetCoagulation factor X
LigandBDBM238258
Substrate/Competitorn/a
Meas. Tech.In Vitro Assay
IC50>100000±n/a nM
Citation Imagawa, AKondo, TNishiyama, TCourtney, SYarnold, CIchihara, OFlanagan, S Substituted pyrrolidines as factor xia inhibitors for the treatment thromboembolic diseases US Patent US9394250 Publication Date 7/19/2016
 
Coagulation factor X
Name:Coagulation factor X
Type:Enzyme
Mol. Mass.:54726.60
Organism:Homo sapiens (Human)
Description:n/a
Residue:488
BDBM238258
NameBDBM238258
Synonyms:US10882855, Example 69 US9585881, Example 69
TypeSmall organic molecule
Emp. Form.C28H40N8O5S
Mol. Mass.600.733
SMILESCOC(=O)Nc1ccc(cc1)-c1cnc([nH]1)[C@@H]1C[C@@H](CN1C(=O)C1CCN(CC1)C(N)=N)C1CCN(CC1)S(C)(=O)=O