Reaction Details
TargetCoagulation factor X
LigandBDBM238262
Substrate/Competitorn/a
Meas. Tech.In Vitro Assay
IC50>100000±n/a nM
Citation Imagawa, AKondo, TNishiyama, TCourtney, SYarnold, CIchihara, OFlanagan, S Substituted pyrrolidines as factor xia inhibitors for the treatment thromboembolic diseases US Patent US9394250 Publication Date 7/19/2016
 
Coagulation factor X
Name:Coagulation factor X
Type:Enzyme
Mol. Mass.:54726.60
Organism:Homo sapiens (Human)
Description:n/a
Residue:488
BDBM238262
NameBDBM238262
Synonyms:US9394250, 86
TypeSmall organic molecule
Emp. Form.C30H43ClN6O5S
Mol. Mass.635.218
SMILESCOC(=O)Nc1ccc(cc1)-c1[nH]c(nc1Cl)[C@@H]1C[C@@H](CN1C(=O)[C@H]1CCC(CC1)[C@H](C)N)C1CCN(CC1)S(C)(=O)=O