Reaction Details
TargetMuscarinic acetylcholine receptor M3
LigandBDBM103753
Substrate/Competitorn/a
Meas. Tech.Radioligand Binding Assay
Temperature310.15±n/a K
Ki 0.1±n/a nM
Commentsextracted
Citation Hughes, ADByun, DJacobsen, JR Diamide compounds having muscarinic receptor antagonist and BETA2 adrenergic receptor agonist activity US Patent US9394275 Publication Date 7/19/2016
 
Muscarinic acetylcholine receptor M3
Name:Muscarinic acetylcholine receptor M3
Type:Enzyme
Mol. Mass.:66151.03
Organism:Homo sapiens (Human)
Description:P20309
Residue:590
BDBM103753
NameBDBM103753
Synonyms:US8551978, I-21 US9394275, I-21 US9682957, I-21
TypeSmall organic molecule
Emp. Form.C46H54N6O7
Mol. Mass.802.957
SMILESCN(CCCCC(=O)Nc1ccc(CCNC[C@H](O)c2ccc(O)c3[nH]c(=O)ccc23)cc1)C(=O)CCN1CCC(CC1)OC(=O)Nc1ccccc1-c1ccccc1