Reaction Details
TargetMuscarinic acetylcholine receptor M3
LigandBDBM103745
Substrate/Competitorn/a
Meas. Tech.Radioligand Binding Assay
Temperature310.15±n/a K
Ki 0.1±n/a nM
Commentsextracted
Citation Hughes, ADByun, DJacobsen, JR Diamide compounds having muscarinic receptor antagonist and BETA2 adrenergic receptor agonist activity US Patent US9394275 Publication Date 7/19/2016
 
Muscarinic acetylcholine receptor M3
Name:Muscarinic acetylcholine receptor M3
Type:Enzyme
Mol. Mass.:66151.03
Organism:Homo sapiens (Human)
Description:P20309
Residue:590
BDBM103745
NameBDBM103745
Synonyms:US8551978, I-10 US9394275, I-10 US9682957, I-10
TypeSmall organic molecule
Emp. Form.C46H54N6O7
Mol. Mass.802.957
SMILESCC(Cc1cccc(NC(=O)CCCN(C)C(=O)CCN2CCC(CC2)OC(=O)Nc2ccccc2-c2ccccc2)c1)NC[C@H](O)c1ccc(O)c2[nH]c(=O)ccc12