Reaction Details
Target5'-AMP-activated protein kinase catalytic subunit alpha-1/subunit beta-1/subunit gamma-1
LigandBDBM237975
Substrate/Competitorn/a
Meas. Tech.33P-Based Assay
pH7.5±n/a
Temperature298.15±n/a K
EC50 89.2±n/a nM
Commentsextracted
Citation Bhattacharya, SKCameron, KODowling, MSEbner, DCEdmonds, DJFernando, DPFilipski, KJKung, DWLee, ECSmith, ACTu, MM Indole and indazole compounds that activate AMPK US Patent US9394285 Publication Date 7/19/2016
 
5'-AMP-activated protein kinase catalytic subunit alpha-1/subunit beta-1/subunit gamma-1
Name:5'-AMP-activated protein kinase catalytic subunit alpha-1/subunit beta-1/subunit gamma-1
Type:n/a
Mol. Mass.:n/a
Description:n/a
Components:This complex has 0 components.
Component 1
Name:5'-AMP-activated protein kinase subunit beta-1
Synonyms:5'-AMP-activated protein kinase subunit beta-1 AMP-activated protein kinase alpha-2/beta-1/gamma-3 AMPK subunit beta-1 PRKAB1
Type:n/a
Mol. Mass.:30380.94
Organism:Homo sapiens (Human)
Description:Q9Y478
Residue:270
Component 2
Name:5'-AMP-activated protein kinase subunit gamma-1
Synonyms:5'-AMP-activated protein kinase subunit gamma-1 AMP-activated protein kinase, gamma-1 subunit AMPK gamma-1 AMPK subunit gamma-1 PRKAG1
Type:n/a
Mol. Mass.:37581.44
Organism:Homo sapiens (Human)
Description:P54619
Residue:331
Component 3
Name:5'-AMP-activated protein kinase catalytic subunit alpha-1
Synonyms:AAPK1_HUMAN AMP-activated protein kinase alpha-1/beta-2/gamma-2 AMPK subunit alpha-1 AMPK1 PRKAA1 | Tau-protein kinase PRKAA1
Type:Protein
Mol. Mass.:64023.62
Organism:Homo sapiens (Human)
Description:Q13131
Residue:559
BDBM237975
NameBDBM237975
Synonyms:US9394285, 58
TypeSmall organic molecule
Emp. Form.C18H15ClFNO4
Mol. Mass.363.767
SMILESOCCCOc1ccc(cc1F)-c1cc2c(c[nH]c2cc1Cl)C(O)=O