Reaction Details
TargetEpidermal growth factor receptor [668-1210]
LigandBDBM238271
Substrate/Competitorn/a
Meas. Tech.Omnia Assay
pH7.5±n/a
IC50 5±n/a nM
Commentsextracted
Citation Lee, KNiu, DBaevsky, MF Mutant-selective EGFR inhibitors and uses thereof US Patent US9409887 Publication Date 8/9/2016
 
Epidermal growth factor receptor [668-1210]
Name:Epidermal growth factor receptor [668-1210]
Type:Cytoplasmic region
Mol. Mass.:61304.06
Organism:Homo sapiens (Human)
Description:Wildtype EGFR was purchased from Invitrogen.
Residue:543
BDBM238271
NameBDBM238271
Synonyms:US9409887, I-2
TypeSmall organic molecule
Emp. Form.C26H26F3N7O3
Mol. Mass.541.5249
SMILESCOc1cc(NC2CN(C2)C(C)=O)ccc1Nc1ncc(c(Nc2cccc(NC(=O)C=C)c2)n1)C(F)(F)F