Reaction Details
TargetEpidermal growth factor receptor [668-1210]
LigandBDBM238272
Substrate/Competitorn/a
Meas. Tech.Omnia Assay
pH7.5±n/a
IC50 200±n/a nM
Commentsextracted
Citation Lee, KNiu, DBaevsky, MF Mutant-selective EGFR inhibitors and uses thereof US Patent US9409887 Publication Date 8/9/2016
 
Epidermal growth factor receptor [668-1210]
Name:Epidermal growth factor receptor [668-1210]
Type:Cytoplasmic region
Mol. Mass.:61304.06
Organism:Homo sapiens (Human)
Description:Wildtype EGFR was purchased from Invitrogen.
Residue:543
BDBM238272
NameBDBM238272
Synonyms:US9409887, I-3
TypeSmall organic molecule
Emp. Form.C29H32F3N7O4
Mol. Mass.599.6041
SMILESCOc1cc(NC2CN(C2)C(=O)OC(C)(C)C)ccc1Nc1ncc(c(Nc2cccc(NC(=O)C=C)c2)n1)C(F)(F)F