Reaction Details
TargetCarbonic anhydrase 1
LigandBDBM238307
Substrate/Competitorn/a
Meas. Tech.Hydratase Activity Assay
IC50 75±n/a nM
Citation Büyükkidan, NBülbül, MKasimogullari, RBüyükkidan, B Synthesis and characterization of metal complexes of heterocyclic sulfonamide as carbonic anhydrase inhibitors. J Enzyme Inhib Med Chem28:311-5 (2013) 
 
Carbonic anhydrase 1
Name:Carbonic anhydrase 1
Type:Enzyme
Mol. Mass.:28873.37
Organism:Homo sapiens (Human)
Description:P00915
Residue:261
BDBM238307
NameBDBM238307
Synonyms:[NiL2(H2O)2] (3)
TypeSmall organic molecule
Emp. Form.C50H32N14NiO12S4
Mol. Mass.1207.829
SMILESNS(=O)(=O)c1nnc(s1)N1C(=O)C2=[N](N(C(=C2C(=O)c2ccccc2)c2ccccc2)c2cccc(c2)[N+]([O-])=O)[Ni]11N(C(=O)C2=[N]1N(C(=C2C(=O)c1ccccc1)c1ccccc1)c1cccc(c1)[N+]([O-])=O)c1nnc(s1)S(N)(=O)=O