Reaction Details
TargetCarbonic anhydrase 2
LigandBDBM238308
Substrate/Competitorn/a
Meas. Tech.Hydratase Activity Assay
IC50 2.2e+3±n/a nM
Citation Büyükkidan, NBülbül, MKasimogullari, RBüyükkidan, B Synthesis and characterization of metal complexes of heterocyclic sulfonamide as carbonic anhydrase inhibitors. J Enzyme Inhib Med Chem28:311-5 (2013) 
 
Carbonic anhydrase 2
Name:Carbonic anhydrase 2
Type:Enzyme
Mol. Mass.:29250.71
Organism:Homo sapiens (Human)
Description:P00918
Residue:260
BDBM238308
NameBDBM238308
Synonyms:[CuL2(H2O)2].H2O (4)
TypeSmall organic molecule
Emp. Form.C50H32CuN14O12S4
Mol. Mass.1212.682
SMILESNS(=O)(=O)c1nnc(s1)N1C(=O)C2=[N](N(C(=C2C(=O)c2ccccc2)c2ccccc2)c2cccc(c2)[N+]([O-])=O)[Cu]11N(C(=O)C2=[N]1N(C(=C2C(=O)c1ccccc1)c1ccccc1)c1cccc(c1)[N+]([O-])=O)c1nnc(s1)S(N)(=O)=O