Reaction Details
TargetCarbonic anhydrase 1
LigandBDBM238305
Substrate/Competitorn/a
Meas. Tech.Esterase Activity Assay
pH7.4±n/a
IC50 1.4e+3±n/a nM
Commentsextracted
Citation Büyükkidan, NBülbül, MKasimogullari, RBüyükkidan, B Synthesis and characterization of metal complexes of heterocyclic sulfonamide as carbonic anhydrase inhibitors. J Enzyme Inhib Med Chem28:311-5 (2013) 
 
Carbonic anhydrase 1
Name:Carbonic anhydrase 1
Type:Enzyme
Mol. Mass.:28873.37
Organism:Homo sapiens (Human)
Description:P00915
Residue:261
BDBM238305
NameBDBM238305
Synonyms:N-[5-(aminosulfonyl)-1,3,4-thiadiazol-2-yl]-4-benzoyl-1-(3-nitrophenyl)-5-phenyl-1H-pyrazole-3-carboxamide (1)
TypeSmall organic molecule
Emp. Form.C25H17N7O6S2
Mol. Mass.575.576
SMILESNS(=O)(=O)c1nnc(NC(=O)c2nn(c(c2C(=O)c2ccccc2)-c2ccccc2)-c2cccc(c2)[N+]([O-])=O)s1