Reaction Details
TargetCarbonic anhydrase 1
LigandBDBM238309
Substrate/Competitorn/a
Meas. Tech.CA Activity Assay
IC50 4.905e+4±n/a nM
Citation Büyükkidan, NBüyükkidan, BBülbül, MÖzer, SGonca Yalçin, H Synthesis and characterization of phenolic Mannich bases and effects of these compounds on human carbonic anhydrase isozymes I and II. J Enzyme Inhib Med Chem28:337-42 (2013) 
 
Carbonic anhydrase 1
Name:Carbonic anhydrase 1
Type:Enzyme
Mol. Mass.:28873.37
Organism:Homo sapiens (Human)
Description:P00915
Residue:261
BDBM238309
NameBDBM238309
Synonyms:3,4-Dimethylphenol (1)
TypeSmall organic molecule
Emp. Form.C8H10O
Mol. Mass.122.1644
SMILESCc1ccc(O)cc1C