Reaction Details
TargetLysine-specific demethylase 4C
LigandBDBM293666
Substrate/Competitorn/a
Meas. Tech.JMJD2C Assay
Temperature298.15±n/a K
IC50 550±n/a nM
Commentsextracted
Citation Boloor, AChen, YKWallace, MB Histone demethylase inhibitors US Patent US10106534 Publication Date 10/23/2018
 
Lysine-specific demethylase 4C
Name:Lysine-specific demethylase 4C
Type:Protein
Mol. Mass.:119979.01
Organism:Homo sapiens (Human)
Description:Q9H3R0
Residue:1056
BDBM293666
NameBDBM293666
Synonyms:3-({[(1R)-6-[(4-fluorophenyl)(methyl)amino]-1,2,3,4- | US10106534, Example 8
TypeSmall organic molecule
Emp. Form.C24H24FN3O2
Mol. Mass.405.4647
SMILESCN(c1ccc(F)cc1)c1ccc2[C@H](CNc3cnccc3C(O)=O)CCCc2c1